{"text_format":"1","workbook":"xlsx","n_sheets":9,"sheets":["HOME","PRINT CHEQUE","PRINT BACK SIDE","ISSUED LIST","REPORT","HELP","ABOUT","programing","DASHBOARD"],"not_rendered":{"charts":0,"images":35,"macros":1,"external_links":0,"defined_names":10,"comments":0,"pivot_tables":0},"unopened":[],"bounds":{"document_bytes":16777216,"sheet_cells":100000,"rows_first":2000,"rows_last":500,"rows_between":2000,"halvings":0,"cell_chars":16384,"cell_head_chars":4096},"cells_cut":0,"cells_raw":0,"read":"whole","date_system":"1900"}

{"sheet":"HOME","index":0,"n_rows":0,"n_cols":0,"rows_kept":0,"cut":false,"hidden":false,"merged":[]}

{"sheet":"PRINT CHEQUE","index":1,"n_rows":23,"n_cols":27,"rows_kept":23,"cut":false,"hidden":false,"merged":[[15,6,15,9],[16,18,16,20],[5,16,5,31],[6,17,6,21],[7,17,11,21],[13,18,15,20],[6,23,7,30],[8,23,8,30],[9,23,11,27],[9,28,11,30],[13,22,13,30],[19,13,20,14],[22,1,23,14],[19,1,20,4],[19,5,20,6],[19,7,20,8],[19,9,20,10],[19,11,20,12],[1,22,1,25],[2,22,2,25],[3,22,3,25],[4,22,4,25],[1,16,1,21],[2,16,2,21],[3,16,3,21],[4,16,4,21],[1,30,2,31],[3,30,4,31],[1,26,1,29],[2,26,2,29],[3,26,3,29],[4,26,4,29],[22,17,22,30],[14,22,14,25],[16,22,16,25],[15,22,15,25],[14,26,14,30],[15,26,15,30],[16,26,16,30],[18,17,21,30]]}
[]
[null,null,null,null,null,null,null,null,null,null,null,null,null,null,null,null,"Customization",null,null,null,null,null,"Prefix",null,null,null,"Suffix"]
[null,null,null,null,null,null,null,null,null,null,null,null,null,null,null,null,"NAME",null,null,null,null,null,"**",null,null,null,"**"]
[null,null,null,null,null,null,null,null,null,null,null,null,null,null,null,null,"AMOUNT",null,null,null,null,null,"**",null,null,null,"/-"]
[null,null,null,null,null,null,null,null,null,null,null,null,null,null,null,null,"AMOUNT TEXT",null,null,null,null,null,"**",null,null,null,"Only /-"]
[]
[null,null,null,null,null,null,null,null,null,null,null,null,null,null,null,null,null,5,null,null,null,null,null,{"$f":"\"Total Words In Text Amount Is \"&programing!AP4","v":"Total Words In Text Amount Is 48"}]
[]
[null,null,null,null,null,null,null,null,null,null,null,null,null,null,null,null,null,null,null,null,null,null,null,"Arjust Words in 1st row of two rows"]
[null,null,null,null,null,null,null,null,null,null,null,null,null,null,null,null,null,null,null,null,null,null,null,60]
{"$rows_left_out":14}
{"sheet":"PRINT BACK SIDE","index":2,"n_rows":23,"n_cols":27,"rows_kept":23,"cut":false,"hidden":false,"merged":[[22,17,22,30],[15,26,15,30],[16,22,16,25],[16,26,16,30],[16,18,16,20],[18,17,21,30],[22,1,23,14],[19,1,20,4],[19,5,20,6],[19,7,20,8],[19,9,20,10],[19,11,20,12],[19,13,20,14],[3,30,4,31],[1,16,4,29],[1,30,2,31],[6,25,7,30],[13,18,15,20],[6,17,6,21],[7,17,11,21],[6,23,7,24],[8,23,9,23],[8,24,9,30],[10,24,11,30],[10,23,11,23],[13,22,13,30],[14,22,14,25],[14,26,14,30],[15,22,15,25]]}
[]
[null,null,null,null,null,null,null,null,null,null,null,null,null,null,null,null,"PRINT BACK SIDE OF CHEQUE"]
[]
[]
[]
[]
[null,null,null,null,null,null,null,null,null,null,null,null,null,null,null,null,null,{"$f":"'PRINT CHEQUE'!R7:V7","v":5},null,null,null,null,null,null,null,"OTHER NOTES"]
[]
[null,null,null,null,null,null,null,null,null,null,null,null,null,null,null,null,null,null,null,null,null,null,null,1,"Address"]
[]
{"$rows_left_out":14}
{"sheet":"ISSUED LIST","index":3,"n_rows":122,"n_cols":17,"rows_kept":122,"cut":false,"hidden":false,"merged":[[2,2,2,16],[4,11,4,16],[4,2,4,10]]}
[]
[]
[]
[]
[null,{"$f":"'PRINT CHEQUE'!R7","v":5},"FRONT SIDE OF CHEQUE",null,null,null,null,null,null,null,null,"BACK SIDE OF CHEQUE"]
[null,"S.No.","Cheque Date","Company Name","Amount","Cheque Type","Cheque No.","Remarks","Post Date","Days to mature","Duration","Beneficiary Name","A/c Type","Beneficiary A/c No.","Mobile No.","Bank Name","IFSC Code"]
[null,{"$f":"IF(ISSUELIST[[#This Row],[Company Name]]=\"\",\"\", COUNTIF( INDEX(ISSUELIST[Company Name],1) : ISSUELIST[[#This Row],[Company Name]], \"<>\" ) )","v":1},"2025-09-18","Smart Computers",15598,"A/c Payee",680235,"Misc","2025-09-02",{"$f":"IF(ISSUELIST[[#This Row],[Cheque Date]]=\"\",\"\",IF(ISSUELIST[[#This Row],[Post Date]]>ISSUELIST[[#This Row],[Cheque Date]],\"INVALID DATE\",IF(ISSUELIST[[#This Row],[Cheque Date]]-TODAY()>0,ISSUELIST[[#This Row],[Cheque Date]]-TODAY()&\" Days to go\",IF(ISSUELIST[[#This Row],[Cheque Date]]-TODAY()=0,\"TODAY\",\"\"))))","v":""},{"$f":"IF(ISSUELIST[[#This Row],[Cheque Date]]=\"\",\"\",IF(ISSUELIST[[#This Row],[Post Date]]=\"\",\"\",ISSUELIST[[#This Row],[Cheque Date]]-ISSUELIST[[#This Row],[Post Date]]))","v":16},"Mahesh Soni","Current A/c",165408911385,9067155384,"SBI","SBI0793188"]
[null,{"$f":"IF(ISSUELIST[[#This Row],[Company Name]]=\"\",\"\", COUNTIF( INDEX(ISSUELIST[Company Name],1) : ISSUELIST[[#This Row],[Company Name]], \"<>\" ) )","v":2},"2025-11-10","City Supermarket",32809,"A/c Payee",706755,"Payment","2025-10-12",{"$f":"IF(ISSUELIST[[#This Row],[Cheque Date]]=\"\",\"\",IF(ISSUELIST[[#This Row],[Post Date]]>ISSUELIST[[#This Row],[Cheque Date]],\"INVALID DATE\",IF(ISSUELIST[[#This Row],[Cheque Date]]-TODAY()>0,ISSUELIST[[#This Row],[Cheque Date]]-TODAY()&\" Days to go\",IF(ISSUELIST[[#This Row],[Cheque Date]]-TODAY()=0,\"TODAY\",\"\"))))","v":"33 Days to go"},{"$f":"IF(ISSUELIST[[#This Row],[Cheque Date]]=\"\",\"\",IF(ISSUELIST[[#This Row],[Post Date]]=\"\",\"\",ISSUELIST[[#This Row],[Cheque Date]]-ISSUELIST[[#This Row],[Post Date]]))","v":29},"Pawan Singh","Saving A/c",390793966518,9008473344,"ICICI","ICIC0988424"]
[null,{"$f":"IF(ISSUELIST[[#This Row],[Company Name]]=\"\",\"\", COUNTIF( INDEX(ISSUELIST[Company Name],1) : ISSUELIST[[#This Row],[Company Name]], \"<>\" ) )","v":3},"2025-11-11","New Fashion Corner",20968,"A/c Payee",309897,"Payment","2025-10-19",{"$f":"IF(ISSUELIST[[#This Row],[Cheque Date]]=\"\",\"\",IF(ISSUELIST[[#This Row],[Post Date]]>ISSUELIST[[#This Row],[Cheque Date]],\"INVALID DATE\",IF(ISSUELIST[[#This Row],[Cheque Date]]-TODAY()>0,ISSUELIST[[#This Row],[Cheque Date]]-TODAY()&\" Days to go\",IF(ISSUELIST[[#This Row],[Cheque Date]]-TODAY()=0,\"TODAY\",\"\"))))","v":"34 Days to go"},{"$f":"IF(ISSUELIST[[#This Row],[Cheque Date]]=\"\",\"\",IF(ISSUELIST[[#This Row],[Post Date]]=\"\",\"\",ISSUELIST[[#This Row],[Cheque Date]]-ISSUELIST[[#This Row],[Post Date]]))","v":23},"Prakash Nayak","Saving A/c",922876620225,9349568052,"PNB","PNB0624033"]
[null,{"$f":"IF(ISSUELIST[[#This Row],[Company Name]]=\"\",\"\", COUNTIF( INDEX(ISSUELIST[Company Name],1) : ISSUELIST[[#This Row],[Company Name]], \"<>\" ) )","v":4},"2025-11-19","Sai Stationery",43084,"A/c Payee",899986,"Advance","2025-10-15",{"$f":"IF(ISSUELIST[[#This Row],[Cheque Date]]=\"\",\"\",IF(ISSUELIST[[#This Row],[Post Date]]>ISSUELIST[[#This Row],[Cheque Date]],\"INVALID DATE\",IF(ISSUELIST[[#This Row],[Cheque Date]]-TODAY()>0,ISSUELIST[[#This Row],[Cheque Date]]-TODAY()&\" Days to go\",IF(ISSUELIST[[#This Row],[Cheque Date]]-TODAY()=0,\"TODAY\",\"\"))))","v":"42 Days to go"},{"$f":"IF(ISSUELIST[[#This Row],[Cheque Date]]=\"\",\"\",IF(ISSUELIST[[#This Row],[Post Date]]=\"\",\"\",ISSUELIST[[#This Row],[Cheque Date]]-ISSUELIST[[#This Row],[Post Date]]))","v":35},"Ranjan Rout","Current A/c",271449344387,9043419864,"SBI","SBI0758901"]
{"$rows_left_out":113}
{"sheet":"REPORT","index":4,"n_rows":32,"n_cols":9,"rows_kept":32,"cut":false,"hidden":false,"merged":[[21,8,22,8],[18,6,18,7],[19,6,19,7],[20,6,20,7],[31,1,31,4],[30,1,30,2],[21,6,22,7],[2,1,3,8],[13,6,13,7],[9,6,9,7],[10,6,10,7],[11,6,11,7],[12,6,12,7],[5,8,6,8],[7,8,8,8],[14,6,14,7],[15,6,15,7],[16,6,16,7],[17,6,17,7],[5,1,5,2],[7,6,8,7]]}
[]
[]
[]
[]
[]
[null,"SUBTOTAL",null,{"$f":"SUBTOTAL(9,REPORT!$D$8:$D$29)","v":1131359},{"$f":"SUBTOTAL(9,REPORT!$E$8:$E$29)","v":38},null,"YEAR",2025]
[null,"S.No.","Name","Total Amount","Count of Cheques",null,"MONTH","Aug"]
[null,{"$f":"IF(REPORT!$C8=\"\",\"\", COUNTIF( INDEX(REPORT!$C$8:$C$29,1) : REPORT!$C8, \"<>\" ) )","v":1},"Smart Computers",{"$f":"IF(REPORT!$C8=\"\",\"\",SUMIFS(ISSUELIST[Amount],ISSUELIST[Company Name],REPORT!$C8))","v":15598},{"$f":"IF(REPORT!$C8=\"\",\"\",COUNTIF(ISSUELIST[Company Name],REPORT!$C8))","v":1},null,{"$f":"DATEVALUE(\"1\"&$H$7&$H$6)","v":"2025-08-01"},null,{"$f":"IF(SUMPRODUCT(   (TEXT(ISSUELIST[Cheque Date],\"MMYYYY\")=TEXT(REPORT!G8,\"MMYYYY\")) *   ISSUELIST[Amount])=0,\"\",SUMPRODUCT(   (TEXT(ISSUELIST[Cheque Date],\"MMYYYY\")=TEXT(REPORT!G8,\"MMYYYY\")) *   ISSUELIST[Amount]))","v":""}]
[null,{"$f":"IF(REPORT!$C9=\"\",\"\", COUNTIF( INDEX(REPORT!$C$8:$C$29,1) : REPORT!$C9, \"<>\" ) )","v":2},"City Supermarket",{"$f":"IF(REPORT!$C9=\"\",\"\",SUMIFS(ISSUELIST[Amount],ISSUELIST[Company Name],REPORT!$C9))","v":183756},{"$f":"IF(REPORT!$C9=\"\",\"\",COUNTIF(ISSUELIST[Company Name],REPORT!$C9))","v":6}]
[null,{"$f":"IF(REPORT!$C10=\"\",\"\", COUNTIF( INDEX(REPORT!$C$8:$C$29,1) : REPORT!$C10, \"<>\" ) )","v":3},"New Fashion Corner",{"$f":"IF(REPORT!$C10=\"\",\"\",SUMIFS(ISSUELIST[Amount],ISSUELIST[Company Name],REPORT!$C10))","v":76458},{"$f":"IF(REPORT!$C10=\"\",\"\",COUNTIF(ISSUELIST[Company Name],REPORT!$C10))","v":5},null,"MONTH WISE REOPRT",null,"CHEQUE AMOUNT"]
{"$rows_left_out":23}
{"sheet":"HELP","index":5,"n_rows":49,"n_cols":49,"rows_kept":49,"cut":false,"hidden":false,"merged":[[4,1,4,12],[48,2,48,58],[47,2,47,58],[10,10,10,15],[11,10,11,15],[12,10,12,15],[13,10,13,15],[14,10,14,15],[8,48,13,58],[10,17,10,24],[11,17,11,24],[12,17,12,24],[13,17,13,24],[14,17,14,26],[16,8,17,44]]}
[]
[]
[]
[]
[null,"Use instructions ……."]
[]
[]
[]
[null,null,null,null,null,null,null,null,null,null,null,null,null,null,null,null,null,null,null,null,null,null,null,null,null,null,null,null,null,null,null,null,null,null,null,null,null,null,null,null,null,null,null,null,null,null,null,null,"Please insert the cheque carefully into the printer’s tray in the correct position, exactly as shown in the image below, to ensure accurate printing without alignment or format issues."]
[]
{"$rows_left_out":40}
{"sheet":"ABOUT","index":6,"n_rows":41,"n_cols":35,"rows_kept":41,"cut":false,"hidden":false,"merged":[[27,34,27,58],[49,3,49,29],[49,34,49,58],[27,3,27,31],[25,34,25,58],[26,34,26,58],[39,26,39,34],[40,27,40,33],[38,26,38,34],[24,3,24,31],[25,3,25,31],[26,3,26,31],[17,34,17,58],[28,3,28,31],[18,34,18,58],[19,34,19,58],[20,34,20,58],[21,34,21,58],[22,34,22,58],[23,34,23,58],[22,3,22,31],[23,3,23,31],[24,34,24,58],[17,3,17,31],[18,3,18,31],[19,3,19,31],[20,3,20,31],[21,3,21,31],[4,22,4,40],[6,6,13,54],[14,27,14,36],[16,34,16,58],[16,3,16,31]]}
[]
[]
[]
[]
[null,null,null,null,null,null,null,null,null,null,null,null,null,null,null,null,null,null,null,null,null,null,"Introduction to My Cheque Print"]
[]
[null,null,null,null,null,null,"My Cheque Print is a simple and powerful Excel-based software designed to make cheque printing effortless. Whether you need to print cheques for personal use or business, this tool allows you to customize layouts according to any bank’s format. With options to change fonts, and rearrange details, every cheque looks professional and accurate.\nBuilt with user-friendliness in mind, My Cheque Print requires no technical knowledge—just open Excel, enter your details, and print. It helps you save time, reduce errors, and keep your cheque management organized and reliable."]
[]
[]
[]
{"$rows_left_out":32}
{"sheet":"programing","index":7,"n_rows":37,"n_cols":45,"rows_kept":37,"cut":false,"hidden":false,"merged":[[6,1,7,1],[6,2,7,6],[11,16,11,20],[11,22,11,26],[26,2,26,14],[15,2,15,14],[17,2,17,14],[18,2,18,14],[19,2,19,14],[20,2,20,14],[21,2,21,14],[22,2,22,14],[8,1,14,1],[25,23,25,34],[3,2,3,5],[4,2,4,14],[34,16,34,38],[6,44,7,45],[6,7,7,14],[6,36,7,40],[8,16,8,20],[8,44,8,45],[6,16,6,34],[7,16,7,34],[5,44,5,45],[3,41,3,43],[3,44,3,45],[3,16,3,40],[5,16,5,34],[34,40,34,42],[36,21,36,26],[26,44,26,45],[26,16,26,22],[20,23,20,34],[21,23,21,34],[22,23,22,34],[23,23,23,34],[24,23,24,34],[26,23,26,34],[20,16,20,22],[21,16,21,22],[22,16,22,22],[23,16,23,22],[24,16,24,22],[25,16,25,22],[28,16,28,18],[5,2,5,14],[25,2,25,14],[24,2,24,14],[11,34,11,38],[14,16,14,20],[11,28,11,32],[8,7,10,9],[8,10,10,14],[23,2,23,14],[16,2,16,14],[8,2,10,6],[30,9,30,14],[30,2,30,7],[28,20,28,38],[28,40,28,42],[28,2,28,14],[30,20,30,23],[30,25,30,28],[30,30,30,33],[30,40,30,42],[32,16,32,18],[30,43,30,44],[30,35,30,38],[32,20,32,23],[32,25,32,28],[32,30,32,33],[32,35,32,38],[30,16,30,18],[32,40,32,42]]}
[]
[]
[]
[null,"S.No.",{"$f":"'PRINT CHEQUE'!$R$7","v":5},null,null,null,null,null,null,null,null,null,null,null,null,null,{"$f":"IF($Q$29=TRUE,IF($C$7=\"not found\",\"Amount not found\",IF($AS$4=TRUE,'PRINT CHEQUE'!W5&\" \"&NumberToWords($C$7)&\" \"&'PRINT CHEQUE'!AA5,NumberToWords($C$7))),$U$29)","v":"** Forty Five Thousand Three Hundred One Only /-"},null,null,null,null,null,null,null,null,null,null,null,null,null,null,null,null,null,null,null,null,null,null,null,null,{"$f":"LEN(Q4)","v":48},null,null,true]
[null,"Cheque Date",{"$f":"IF($Q$29=TRUE,IFERROR(VLOOKUP(C4,ISSUELIST[#All],2,FALSE),\"Notfound\"),$AO$29)","v":"2025-11-27"},null,null,null,null,null,null,null,null,null,null,null,null,null,{"$f":"MID(TEXT($C$5,\"DDMMYYYY\"),1,1)","v":"2"},{"$f":"MID(TEXT($C$5,\"DDMMYYYY\"),2,1)","v":"7"},{"$f":"MID(TEXT($C$5,\"DDMMYYYY\"),3,1)","v":"1"},{"$f":"MID(TEXT($C$5,\"DDMMYYYY\"),4,1)","v":"1"},{"$f":"MID(TEXT($C$5,\"DDMMYYYY\"),5,1)","v":"2"},{"$f":"MID(TEXT($C$5,\"DDMMYYYY\"),6,1)","v":"0"},{"$f":"MID(TEXT($C$5,\"DDMMYYYY\"),7,1)","v":"2"},{"$f":"MID(TEXT($C$5,\"DDMMYYYY\"),8,1)","v":"5"}]
[null,"Company Name",{"$f":"IF($Q$29=TRUE,IFERROR(VLOOKUP($C$4,ISSUELIST[#All],3,FALSE),\"Not found\"),$U$29)","v":"Shanti Hardware"},null,null,null,null,null,null,null,null,null,null,null,null,null,{"$f":"IF(C6=\"Not found\",\"Not found\",IF($AS$6=TRUE,'PRINT CHEQUE'!$W$3&\" \"&programing!$C$6&\" \"&'PRINT CHEQUE'!$AA$3,programing!$C$6))","v":"** Shanti Hardware **"},null,null,null,null,null,null,null,null,null,null,null,null,null,null,null,null,null,null,null,null,null,null,null,null,null,null,null,true]
[null,"Amount",{"$f":"IFERROR(VLOOKUP($C$4,ISSUELIST[#All],4,FALSE),\"Not found\")","v":45301},null,null,null,null,null,null,null,null,null,null,null,null,null,{"$f":"LEFT(Q4,IFERROR(FIND(\" \",Q4,'PRINT CHEQUE'!X10),LEN(Q4)))","v":"** Forty Five Thousand Three Hundred One Only /-"},null,null,null,null,null,null,null,null,null,null,null,null,null,null,null,null,null,null,null,{"$f":"IF($Q$29=TRUE,IF($C$7=\"Not found\",\"Not found\",IF($AS$7=TRUE,'PRINT CHEQUE'!$W$4&\" \"&TEXT($C$7,\"#,##,##0\")&\" \"&'PRINT CHEQUE'!AA4,TEXT($C$7,\"#,##,##0\"))),$AO$29)","v":"** 45,301 /-"},null,null,null,null,null,null,null,true]
[null,null,null,null,null,null,null,null,null,null,null,null,null,null,null,null,{"$f":"TRIM(MID(Q4,IFERROR(FIND(\" \",Q4,'PRINT CHEQUE'!X10),LEN(Q4))+1,LEN(Q4)))","v":""}]
[null,"Cheque Type",{"$f":"IFERROR(VLOOKUP($C$4,ISSUELIST[#All],5,FALSE),\"Not found\")","v":"A/c Payee"},null,null,null,null,"style no",null,null,1,null,null,null,null,null,{"$f":"IF($Q$29=TRUE,IF($C$9=\"Not found\",\"Not found\",IF($C$9=\"No\",\"\",IF($AS$9=TRUE,\"A/c Payee Only\",\"A/c Payee\"))),$AO$29)","v":"A/c Payee Only"},null,null,null,null,null,null,null,null,null,null,null,null,null,null,null,null,null,null,null,null,null,null,null,null,null,null,null,true]
[]
{"$rows_left_out":28}
{"sheet":"DASHBOARD","index":8,"n_rows":49,"n_cols":7,"rows_kept":49,"cut":false,"hidden":false,"merged":[[34,2,34,3],[25,4,25,6],[26,4,26,6],[28,4,28,6],[43,2,43,4],[25,2,25,3],[33,4,33,6],[1,1,3,7],[16,2,16,3],[16,4,16,6],[12,4,12,5],[13,4,13,5],[14,4,14,5],[11,4,11,5],[7,4,7,5],[8,4,8,5],[9,4,9,5],[10,4,10,5]]}
[]
[null,"Dashboard"]
[]
[]
[]
[null,null,null,null,{"$f":"NOW()","v":"2025-10-08T13:11:28.080"}]
[]
[null,null,null,"Total NO.of issued cheques","Total Cheques Amount"]
[null,null,null,{"$f":"COUNTA(ISSUELIST[Company Name])","v":38},{"$f":"SUM(ISSUELIST[Amount] )","v":1131359}]
[null,null,null,"Pending Cheques Count","Pending Cheques Amount"]
{"$rows_left_out":39}